Вы здесь

не хочет ставится centericq :(

x86_64-pc-linux-gnu-g++ -DPACKAGE_NAME=\"\" -DPACKAGE_TARNAME=\"\" -DPACKAGE_VERSION=\"\" -DPACKAGE_STRING=\"\" -DPACKAGE_BUGREPORT=\"\" -DPACKAGE=\"kkconsui\" -DVERSION=\"0.1\" -DLOCALES_HACK=1 -DSTDC_HEADERS=1 -DHAVE_SYS_TYPES_H=1 -DHAVE_SYS_STAT_H=1 -DHAVE_STDLIB_H=1 -DHAVE_STRING_H=1 -DHAVE_MEMORY_H=1 -DHAVE_STRINGS_H=1 -DHAVE_INTTYPES_H=1 -DHAVE_STDINT_H=1 -DHAVE_UNISTD_H=1 -DHAVE__G_CONFIG_H=1 -I. -I. -I../include -I../../kkstrtext -I../../kkstrtext-0.1 -O2 -march=athlon64 -pipe -c textinputline.cc
x86_64-pc-linux-gnu-g++ -DPACKAGE_NAME=\"\" -DPACKAGE_TARNAME=\"\" -DPACKAGE_VERSION=\"\" -DPACKAGE_STRING=\"\" -DPACKAGE_BUGREPORT=\"\" -DPACKAGE=\"kkconsui\" -DVERSION=\"0.1\" -DLOCALES_HACK=1 -DSTDC_HEADERS=1 -DHAVE_SYS_TYPES_H=1 -DHAVE_SYS_STAT_H=1 -DHAVE_STDLIB_H=1 -DHAVE_STRING_H=1 -DHAVE_MEMORY_H=1 -DHAVE_STRINGS_H=1 -DHAVE_INTTYPES_H=1 -DHAVE_STDINT_H=1 -DHAVE_UNISTD_H=1 -DHAVE__G_CONFIG_H=1 -I. -I. -I../include -I../../kkstrtext -I../../kkstrtext-0.1 -O2 -march=athlon64 -pipe -c fileselector.cc
x86_64-pc-linux-gnu-g++ -DPACKAGE_NAME=\"\" -DPACKAGE_TARNAME=\"\" -DPACKAGE_VERSION=\"\" -DPACKAGE_STRING=\"\" -DPACKAGE_BUGREPORT=\"\" -DPACKAGE=\"kkconsui\" -DVERSION=\"0.1\" -DLOCALES_HACK=1 -DSTDC_HEADERS=1 -DHAVE_SYS_TYPES_H=1 -DHAVE_SYS_STAT_H=1 -DHAVE_STDLIB_H=1 -DHAVE_STRING_H=1 -DHAVE_MEMORY_H=1 -DHAVE_STRINGS_H=1 -DHAVE_INTTYPES_H=1 -DHAVE_STDINT_H=1 -DHAVE_UNISTD_H=1 -DHAVE__G_CONFIG_H=1 -I. -I. -I../include -I../../kkstrtext -I../../kkstrtext-0.1 -O2 -march=athlon64 -pipe -c textwindow.cc
x86_64-pc-linux-gnu-g++ -DPACKAGE_NAME=\"\" -DPACKAGE_TARNAME=\"\" -DPACKAGE_VERSION=\"\" -DPACKAGE_STRING=\"\" -DPACKAGE_BUGREPORT=\"\" -DPACKAGE=\"kkconsui\" -DVERSION=\"0.1\" -DLOCALES_HACK=1 -DSTDC_HEADERS=1 -DHAVE_SYS_TYPES_H=1 -DHAVE_SYS_STAT_H=1 -DHAVE_STDLIB_H=1 -DHAVE_STRING_H=1 -DHAVE_MEMORY_H=1 -DHAVE_STRINGS_H=1 -DHAVE_INTTYPES_H=1 -DHAVE_STDINT_H=1 -DHAVE_UNISTD_H=1 -DHAVE__G_CONFIG_H=1 -I. -I. -I../include -I../../kkstrtext -I../../kkstrtext-0.1 -O2 -march=athlon64 -pipe -c texteditor.cc
texteditor.cc: In static member function ‘static int ktool::texteditor::findint(void*, void*)’:
texteditor.cc:1943: error: cast from ‘void*’ to ‘int’ loses precision
make[4]: *** [texteditor.o] Ошибка 1
make[4]: *** Ожидание завершения заданий...
make[4]: Leaving directory `/var/tmp/portage/net-im/centericq-4.21.0-r2/work/centericq-4.21.0/kkconsui-0.1/src'
make[3]: *** [all-recursive] Ошибка 1
make[3]: Leaving directory `/var/tmp/portage/net-im/centericq-4.21.0-r2/work/centericq-4.21.0/kkconsui-0.1/src'
make[2]: *** [all-recursive] Ошибка 1
make[2]: Leaving directory `/var/tmp/portage/net-im/centericq-4.21.0-r2/work/centericq-4.21.0/kkconsui-0.1'
make[1]: *** [all-recursive] Ошибка 1
make[1]: Leaving directory `/var/tmp/portage/net-im/centericq-4.21.0-r2/work/centericq-4.21.0'
make: *** [all-recursive-am] Ошибка 2

!!! ERROR: net-im/centericq-4.21.0-r2 failed.
Call stack:
ebuild.sh, line 1568: Called dyn_compile
ebuild.sh, line 937: Called src_compile
centericq-4.21.0-r2.ebuild, line 76: Called die

!!! Compilation failed
!!! If you need support, post the topmost build error, and the call stack if relevant.

что посоветуете ?!

Править руками, или ждать пока исправить кто-то другой.

ставил руками... тоже самое...

Не ставить, а ПРАВИТЬ! покопайтесь в коде, может быть там просто тип не правильно указан.

так я с сайта разработчика скачивал другую версию.... и тоже...
похоже что-то у меня не так....

Ссылка устарела.. выложите патч снова, пожалуйста.

Извиняюсь, снёс случайно. Вернул.